innocent-a
type: LexicalEntry
canonical form: innocent
sense: 02280420-s
part of speech: adjective

ingenuous-a
type: LexicalEntry
canonical form: ingenuous
sense: 02280420-s
part of speech: adjective

02280420-s
type: LexicalConcept
in scheme: en-word.net
definition: lacking in sophistication or worldliness
example: a child's innocent stare
example: his ingenuous explanation that he would not have burned the church if he had not thought the bishop was in it
ili: i12575
lexfile: adj.all
part of speech: adjective satellite
similar: https://en-word.net/synset/02279294-a