lavish-v
type: LexicalEntry
canonical form: lavish
sense: 02269409-v
part of speech: verb

shower-v
type: LexicalEntry
canonical form: shower
sense: 02269409-v
part of speech: verb

02269409-v
type: LexicalConcept
in scheme: en-word.net
definition: expend profusely; also used with abstract nouns
example: He was showered with praise
ili: i33056
lexfile: verb.possession
part of speech: verb
hypernym: 01160479-v