trade-v
type: LexicalEntry
canonical form: trade
sense: 02264892-v
part of speech: verb

trade in-v
type: LexicalEntry
canonical form: trade in
sense: 02264892-v
part of speech: verb

02264892-v
type: LexicalConcept
in scheme: en-word.net
definition: turn in as payment or part payment for a purchase
example: trade in an old car for a new one
ili: i33034
lexfile: verb.possession
part of speech: verb
domain topic: 01092370-n
hypernym: 02262178-v