redeem-v
type: LexicalEntry
canonical form: redeem
sense: 02262040-v
part of speech: verb

02262040-v
type: LexicalConcept
in scheme: en-word.net
definition: to turn in (vouchers or coupons) and receive something in exchange
ili: i33023
lexfile: verb.possession
part of speech: verb
hypernym: 02262178-v