tithe-v
type: LexicalEntry
canonical form: tithe
sense: 02257350-v
part of speech: verb

02257350-v
type: LexicalConcept
in scheme: en-word.net
definition: pay a tenth of one's income; pay one tenth of, especially to the church
example: Although she left the church officially, she still tithes
ili: i32997
lexfile: verb.possession
part of speech: verb
hypernym: 02256551-v