crushed-a
type: LexicalEntry
canonical form: crushed
sense: 02248412-s
part of speech: adjective

02248412-s
type: LexicalConcept
in scheme: en-word.net
definition: treated so as to have a permanently wrinkled appearance
example: crushed velvet
ili: i12385
lexfile: adj.all
part of speech: adjective satellite
similar: https://en-word.net/synset/02246206-a