fall-v
type: LexicalEntry
canonical form: fall
sense: 02234610-v
part of speech: verb

light-v
type: LexicalEntry
canonical form: light
sense: 02234610-v
part of speech: verb

02234610-v
type: LexicalConcept
in scheme: en-word.net
definition: fall to somebody by assignment or lot; passed
example: The task fell to me
example: It fell to me to notify the parents of the victims
ili: i32893
lexfile: verb.possession
part of speech: verb
hypernym: 02234332-v
similar: 02234838-v
similar: 02363654-v