sponsor-v
type: LexicalEntry
canonical form: sponsor
sense: 02224930-v
part of speech: verb

02224930-v
type: LexicalConcept
in scheme: en-word.net
definition: assume responsibility for or leadership of
example: The senator announced that he would sponsor the health care plan
ili: i32845
lexfile: verb.possession
part of speech: verb
hypernym: 02561834-v