buy-v
type: LexicalEntry
canonical form: buy
sense: 02211988-v
part of speech: verb

purchase-v
type: LexicalEntry
canonical form: purchase
sense: 02211988-v
part of speech: verb

02211988-v
type: LexicalConcept
in scheme: en-word.net
definition: obtain by purchase; acquire by means of a financial transaction
example: The family purchased a new car
example: The conglomerate acquired a new company
example: She buys for the big department store
ili: i32788
lexfile: verb.possession
part of speech: verb
domain topic: 01092370-n
entails: 02256551-v
entails: 00676526-v
hypernym: 02215637-v
similar: 02652841-v