worker bee-n
type: LexicalEntry
canonical form: worker bee
sense: 02210457-n
part of speech: noun

02210457-n
type: LexicalConcept
in scheme: en-word.net
definition: sterile bee specialized to collect food and maintain the hive
ili: i47091
lexfile: noun.animal
part of speech: noun
hypernym: 02210101-n