ring-v
type: LexicalEntry
canonical form: ring
sense: 02185984-v
part of speech: verb

knell-v
type: LexicalEntry
canonical form: knell
sense: 02185984-v
part of speech: verb

02185984-v
type: LexicalConcept
in scheme: en-word.net
definition: make (bells) ring, often for the purposes of musical edification
example: Ring the bells
example: My uncle rings every Sunday at the local church
ili: i32660
lexfile: verb.perception
part of speech: verb
causes: 02180712-v
hypernym: 02183962-v