prepare-v
type: LexicalEntry
canonical form: prepare
sense: 02184359-v
part of speech: verb

02184359-v
type: LexicalConcept
in scheme: en-word.net
definition: lead up to and soften by sounding the dissonant note in it as a consonant note in the preceding chord
example: prepare the discord in bar 139
ili: i32650
lexfile: verb.perception
part of speech: verb
domain topic: 07034009-n
hypernym: 02183962-v