fixate-v
type: LexicalEntry
canonical form: fixate
sense: 02175305-v
part of speech: verb

02175305-v
type: LexicalConcept
in scheme: en-word.net
definition: pay attention to exclusively and obsessively
example: The media are fixating on Princess Diana's death
ili: i32608
lexfile: verb.perception
part of speech: verb
hypernym: 02174871-v