significant-a
type: LexicalEntry
canonical form: significant
sense: https://en-word.net/lemma/significant-a#02173212-a
part of speech: adjective

https://en-word.net/synset/02173212-a
type: LexicalConcept
in scheme: en-word.net
definition: too closely correlated to be attributed to chance and therefore indicating a systematic relation
example: the interaction effect is significant at the .01 level
example: no significant difference was found
ili: i11897
lexfile: adj.all
part of speech: adjective
domain topic: 06027814-n