squint-v
type: LexicalEntry
canonical form: squint
sense: 02172514-v
part of speech: verb

02172514-v
type: LexicalConcept
in scheme: en-word.net
definition: be cross-eyed; have a squint or strabismus
ili: i32594
lexfile: verb.perception
part of speech: verb
hypernym: 02134989-v