fundamental-a
type: LexicalEntry
canonical form: fundamental
sense: 02170349-s
part of speech: adjective

profound-a
type: LexicalEntry
canonical form: profound
sense: 02170349-s
part of speech: adjective

02170349-s
type: LexicalConcept
in scheme: en-word.net
definition: far-reaching and thoroughgoing in effect especially on the nature of something
example: the fundamental revolution in human values that has occurred
example: the book underwent fundamental changes
example: committed the fundamental error of confusing spending with extravagance
example: profound social changes
ili: i11884
lexfile: adj.all
part of speech: adjective satellite
similar: https://en-word.net/synset/02168847-a