focus-v
type: LexicalEntry
canonical form: focus
sense: 02166352-v
part of speech: verb

02166352-v
type: LexicalConcept
in scheme: en-word.net
definition: cause to converge on or toward a central point
example: Focus the light on this image
ili: i32560
lexfile: verb.perception
part of speech: verb
hypernym: 02195232-v