scintillate-v
type: LexicalEntry
canonical form: scintillate
sense: 02165760-v
part of speech: verb

02165760-v
type: LexicalConcept
in scheme: en-word.net
definition: fluoresce momentarily when struck by a charged particle or high-energy photon
example: the phosphor scintillated
ili: i32557
lexfile: verb.perception
part of speech: verb
hypernym: 02165590-v