camouflage-v
type: LexicalEntry
canonical form: camouflage
sense: 02163326-v
part of speech: verb

02163326-v
type: LexicalConcept
in scheme: en-word.net
definition: disguise by camouflaging; exploit the natural surroundings to disguise something
example: The troops camouflaged themselves before they went into enemy territory
ili: i32544
lexfile: verb.perception
part of speech: verb
hypernym: 02163017-v