individual-a
type: LexicalEntry
canonical form: individual
sense: 02160589-s
part of speech: adjective

single-a
type: LexicalEntry
canonical form: single
sense: 02160589-s
part of speech: adjective

02160589-s
type: LexicalConcept
in scheme: en-word.net
definition: characteristic of or meant for a single person or thing
example: an individual serving
example: single occupancy
example: a single bed
ili: i11821
lexfile: adj.all
part of speech: adjective satellite
similar: https://en-word.net/synset/02160263-a