visualize-v
type: LexicalEntry
canonical form: visualize
sense: 02155824-v
part of speech: verb

visualise-v
type: LexicalEntry
canonical form: visualise
sense: 02155824-v
part of speech: verb

02155824-v
type: LexicalConcept
in scheme: en-word.net
definition: view the outline of by means of an X-ray
example: The radiologist can visualize the cancerous liver
ili: i32510
lexfile: verb.perception
part of speech: verb
domain topic: 06052606-n
hypernym: 02155378-v