pass off-v
type: LexicalEntry
canonical form: pass off
sense: 02138957-v
part of speech: verb

02138957-v
type: LexicalConcept
in scheme: en-word.net
definition: be accepted as something or somebody in a false character or identity
example: She passed off as a Russian agent
ili: i32424
lexfile: verb.perception
part of speech: verb
hypernym: 02137900-v