lynx-n
type: LexicalEntry
canonical form: lynx
sense: 02129704-n
part of speech: noun

catamount-n
type: LexicalEntry
canonical form: catamount
sense: 02129704-n
part of speech: noun

02129704-n
type: LexicalConcept
in scheme: en-word.net
definition: short-tailed wildcats with usually tufted ears; valued for their fur
ili: i46629
lexfile: noun.animal
part of speech: noun
hypernym: 02127275-n