thrill-v
type: LexicalEntry
canonical form: thrill
sense: 02121816-v
part of speech: verb

02121816-v
type: LexicalConcept
in scheme: en-word.net
definition: cause to be thrilled by some perceptual input
example: The men were thrilled by a loud whistle blow
ili: i32343
lexfile: verb.perception
part of speech: verb
hypernym: 02120601-v