besot-v
type: LexicalEntry
canonical form: besot
sense: 02120101-v
part of speech: verb

stupefy-v
type: LexicalEntry
canonical form: stupefy
sense: 02120101-v
part of speech: verb

02120101-v
type: LexicalConcept
in scheme: en-word.net
definition: make dull or stupid or muddle with drunkenness or infatuation
ili: i32336
lexfile: verb.perception
part of speech: verb
hypernym: 02119407-v