hit-v
type: LexicalEntry
canonical form: hit
sense: 02108439-v
part of speech: verb

strike-v
type: LexicalEntry
canonical form: strike
sense: 02108439-v
part of speech: verb

02108439-v
type: LexicalConcept
in scheme: en-word.net
definition: drive something violently into a location
example: he hit his fist on the table
example: she struck her head on the low ceiling
ili: i32284
lexfile: verb.motion
part of speech: verb
hypernym: 01854282-v