Old English sheepdog-n
type: LexicalEntry
canonical form: Old English sheepdog
sense: 02108293-n
part of speech: noun

bobtail-n
type: LexicalEntry
canonical form: bobtail
sense: 02108293-n
part of speech: noun

02108293-n
type: LexicalConcept
in scheme: en-word.net
definition: large sheepdog with a profuse shaggy bluish-grey-and-white coat and short tail; believed to trace back to the Roman occupation of Britain
ili: i46493
lexfile: noun.animal
part of speech: noun
hypernym: 02107175-n