throw-v
type: LexicalEntry
canonical form: throw
sense: 02101482-v
part of speech: verb

02101482-v
type: LexicalConcept
in scheme: en-word.net
definition: move violently, energetically, or carelessly
example: She threw herself forwards
ili: i32243
lexfile: verb.motion
part of speech: verb
hypernym: 01835473-v