bring about-v
type: LexicalEntry
canonical form: bring about
sense: 02094946-v
part of speech: verb

02094946-v
type: LexicalConcept
in scheme: en-word.net
definition: cause to move into the opposite direction
example: they brought about the boat when they saw a storm approaching
ili: i32205
lexfile: verb.motion
part of speech: verb
hypernym: 02094702-v