heave-v
type: LexicalEntry
canonical form: heave
sense: 02092737-v
part of speech: verb

02092737-v
type: LexicalConcept
in scheme: en-word.net
definition: move or cause to move in a specified way, direction, or position
example: The vessel hove into sight
ili: i32193
lexfile: verb.motion
part of speech: verb
hypernym: 01835473-v