common dolphin-n
type: LexicalEntry
canonical form: common dolphin
sense: 02072065-n
part of speech: noun

Delphinus delphis-n
type: LexicalEntry
canonical form: Delphinus delphis
sense: 02072065-n
part of speech: noun

02072065-n
type: LexicalConcept
in scheme: en-word.net
definition: black-and-white dolphin that leaps high out of the water
ili: i46276
lexfile: noun.animal
part of speech: noun
hypernym: 02071627-n