rorqual-n
type: LexicalEntry
canonical form: rorqual
sense: 02066991-n
part of speech: noun

razorback-n
type: LexicalEntry
canonical form: razorback
sense: 02066991-n
part of speech: noun

02066991-n
type: LexicalConcept
in scheme: en-word.net
definition: any of several baleen whales of the family Balaenopteridae having longitudinal grooves on the throat and a small pointed dorsal fin
ili: i46250
lexfile: noun.animal
part of speech: noun
hypernym: 02065877-n