incline-v
type: LexicalEntry
canonical form: incline
sense: 02066946-v
part of speech: verb

02066946-v
type: LexicalConcept
in scheme: en-word.net
definition: lower or bend (the head or upper body), as in a nod or bow
example: She inclined her head to the student
ili: i32059
lexfile: verb.motion
part of speech: verb
hypernym: 01977139-v