shuttle-v
type: LexicalEntry
canonical form: shuttle
sense: 02066009-v
part of speech: verb

02066009-v
type: LexicalConcept
in scheme: en-word.net
definition: travel back and forth between two points
ili: i32055
lexfile: verb.motion
part of speech: verb
hypernym: 01839438-v