pass off-v
type: LexicalEntry
canonical form: pass off
sense: 02056889-v
part of speech: verb

02056889-v
type: LexicalConcept
in scheme: en-word.net
definition: cause to be circulated and accepted in a false character or identity
example: She passed the glass off as diamonds
example: He passed himself off as a secret agent
ili: i32009
lexfile: verb.motion
part of speech: verb
hypernym: 02056400-v