right-a
type: LexicalEntry
canonical form: right
sense: https://en-word.net/lemma/right-a#02037458-a
part of speech: adjective

https://en-word.net/synset/02037458-a
type: LexicalConcept
in scheme: en-word.net
definition: of or belonging to the political or intellectual right
ili: i11123
lexfile: adj.all
part of speech: adjective
also: https://en-word.net/synset/00576723-a
similar: 02037690-s
similar: 02037803-s
similar: 02037940-s
similar: 02038111-s
similar: 02038200-s