mass-v
type: LexicalEntry
canonical form: mass
sense: 02028014-v
part of speech: verb

02028014-v
type: LexicalConcept
in scheme: en-word.net
definition: join together into a mass or collect or form a mass
example: Crowds were massing outside the palace
ili: i31861
lexfile: verb.motion
part of speech: verb
hypernym: 02031458-v