meet-v
type: LexicalEntry
canonical form: meet
sense: 02026650-v
part of speech: verb

02026650-v
type: LexicalConcept
in scheme: en-word.net
definition: meet by design; be present at the arrival of
example: Can you meet me at the train station?
ili: i31854
lexfile: verb.motion
part of speech: verb
hypernym: 02433771-v