plover-n
type: LexicalEntry
canonical form: plover
sense: 02025995-n
part of speech: noun

02025995-n
type: LexicalConcept
in scheme: en-word.net
definition: any of numerous chiefly shorebirds of relatively compact build having straight bills and large pointed wings; closely related to the sandpipers
ili: i46005
lexfile: noun.animal
part of speech: noun
hypernym: 02025338-n