get through-v
type: LexicalEntry
canonical form: get through
sense: 02025773-v
part of speech: verb

come through-v
type: LexicalEntry
canonical form: come through
sense: 02025773-v
part of speech: verb

02025773-v
type: LexicalConcept
in scheme: en-word.net
definition: succeed in reaching a real or abstract destination after overcoming problems
example: We finally got through the bureaucracy and could talk to the Minister
ili: i31849
lexfile: verb.motion
part of speech: verb
hypernym: 02024442-v