awed-a
type: LexicalEntry
canonical form: awed
sense: 02019253-s
part of speech: adjective

awful-a
type: LexicalEntry
canonical form: awful
sense: 02019253-s
part of speech: adjective

02019253-s
type: LexicalConcept
in scheme: en-word.net
definition: inspired by a feeling of fearful wonderment or reverence
example: awed by the silence
example: awful worshippers with bowed heads
ili: i11021
lexfile: adj.all
part of speech: adjective satellite
similar: https://en-word.net/synset/02018906-a