dull-a
type: LexicalEntry
canonical form: dull
sense: 02018718-s
part of speech: adjective

thudding-a
type: LexicalEntry
canonical form: thudding
sense: 02018718-s
part of speech: adjective

02018718-s
type: LexicalConcept
in scheme: en-word.net
definition: not clear and resonant; sounding as if striking with or against something relatively soft
example: the dull thud
example: thudding bullets
ili: i11018
lexfile: adj.all
part of speech: adjective satellite
similar: https://en-word.net/synset/02018238-a