walk out-v
type: LexicalEntry
canonical form: walk out
sense: 02014252-v
part of speech: verb

02014252-v
type: LexicalConcept
in scheme: en-word.net
definition: leave abruptly, often in protest or anger
example: The customer that was not served walked out
ili: i31788
lexfile: verb.motion
part of speech: verb
hypernym: 02013448-v