shadow-v
type: LexicalEntry
canonical form: shadow
sense: 02005493-v
part of speech: verb

02005493-v
type: LexicalConcept
in scheme: en-word.net
definition: follow, usually without the person's knowledge
example: The police are shadowing her
ili: i31745
lexfile: verb.motion
part of speech: verb
hypernym: 02002464-v