usher-v
type: LexicalEntry
canonical form: usher
sense: 02004579-v
part of speech: verb

show-v
type: LexicalEntry
canonical form: show
sense: 02004579-v
part of speech: verb

02004579-v
type: LexicalConcept
in scheme: en-word.net
definition: take (someone) to their seats, as in theaters or auditoriums
example: he ushered us to our seats
ili: i31741
lexfile: verb.motion
part of speech: verb
hypernym: 02003830-v