draw away-v
type: LexicalEntry
canonical form: draw away
sense: 02003720-v
part of speech: verb

02003720-v
type: LexicalConcept
in scheme: en-word.net
definition: move ahead of (one's competitors) in a race
ili: i31737
lexfile: verb.motion
part of speech: verb
hypernym: 02003455-v