submerge-v
type: LexicalEntry
canonical form: submerge
sense: 01995486-v
part of speech: verb

submerse-v
type: LexicalEntry
canonical form: submerse
sense: 01995486-v
part of speech: verb

01995486-v
type: LexicalConcept
in scheme: en-word.net
definition: sink below the surface; go under or as if under water
ili: i31696
lexfile: verb.motion
part of speech: verb
hypernym: 01993887-v