craw-n
type: LexicalEntry
canonical form: craw
sense: 01976696-n
part of speech: noun

crop-n
type: LexicalEntry
canonical form: crop
sense: 01976696-n
part of speech: noun

01976696-n
type: LexicalConcept
in scheme: en-word.net
definition: a pouch in many birds and some lower animals that resembles a stomach for storage and preliminary maceration of food
ili: i45726
lexfile: noun.animal
part of speech: noun
hypernym: 05403033-n