uplift-v
type: LexicalEntry
canonical form: uplift
sense: 01973608-v
part of speech: verb

01973608-v
type: LexicalConcept
in scheme: en-word.net
definition: lift up from the earth, as by geologic forces
example: the earth's movement uplifted this part of town
ili: i31578
lexfile: verb.motion
part of speech: verb
hypernym: 01972576-v