kick-v
type: LexicalEntry
canonical form: kick
sense: 01940092-v
part of speech: verb

01940092-v
type: LexicalConcept
in scheme: en-word.net
definition: thrash about or strike out with the feet
ili: i31400
lexfile: verb.motion
part of speech: verb
hypernym: 01940220-v